{"text_format":"1","workbook":"xlsx","n_sheets":9,"sheets":["board room","staff and taste","Window","Summary","Solar","Weather_Stations","Wall_R_value","WindowData","RoofData"],"not_rendered":{"charts":2,"images":13,"macros":1,"external_links":1,"defined_names":21,"comments":1,"pivot_tables":0},"unopened":[],"bounds":{"document_bytes":16777216,"sheet_cells":100000,"rows_first":2000,"rows_last":500,"rows_between":2000,"halvings":0,"cell_chars":16384,"cell_head_chars":4096},"cells_cut":0,"cells_raw":0,"read":"whole","date_system":"1900"}

{"sheet":"board room","index":0,"n_rows":78,"n_cols":15,"rows_kept":78,"cut":false,"hidden":false,"merged":[[25,0,25,5],[25,6,25,11],[25,12,25,17],[50,0,50,5]]}
["PROJECT NUMBER","x1610"]
["PROJECT NAME","16060 westminster"]
["INPUT BY","XT",null,null,"Newfoundland"]
["DATE","2016-12-03"]
["City","North Vancouver",null,{"$f":"VLOOKUP(B5,WeatherData,2,FALSE )","v":"BC"}]
["Latitude",{"$f":"VLOOKUP(B5,WeatherData,23,FALSE )","v":49.32},"N","Lfactor",{"$f":"1+(B6-40)*0.0375","v":1.3494999999999999}]
["Winter Design Temp.",{"$f":"D7","v":-7},"degC",{"$f":"VLOOKUP(B5,WeatherData,4,FALSE )","v":-7}]
["Summer Design Temp",{"$f":"D8","v":26},"degC",{"$f":"VLOOKUP(B5,WeatherData,5,FALSE )","v":26}]
["Wall Type","Wall Type 3"]
["Wall R value",{"$f":"D10*0.176","v":2.6399999999999997},"m2/oC/Watt",{"$f":"VLOOKUP(B9,Wall_R_value!B2:D13,2,FALSE)","v":15},"R-Value"]
["Window Type","Window Type 2"]
["Window R value",{"$f":"D12*0.175","v":0.35},"m2/oC/Watt",{"$f":"VLOOKUP(B11,WindowData,3,FALSE)","v":2},"R-Value","SHGC",0.33]
["Roof Type","Roof Type 6"]
["Roof R Value",{"$f":"D14*0.175","v":5.25},"m2/oC/Watt",{"$f":"VLOOKUP(B13,RoofData,2,FALSE)","v":30},"R-Value"]
["Floor Height",3,"meter"]
["Room temp _Winter",22,"degC"]
["Room Temp_Summer",24,"degC"]
[]
["Heating / Cooling Load Calculation"]
[]
["ROOM NO.",null,"Kitchen"]
[null,null,"Winter",null,"Summer"]
["Room Temperature",null,22,"degC",{"$f":"$B$17","v":24},"degC"]
["Temperature difference",null,{"$f":"OT-RoomT","v":-29},"degC",{"$f":"OT_Summer-E23","v":2},"degC"]
["Envelope-Wall"]
["Wall 1",null,null,null,null,null,"Wall 2"]
["Wall dimension","Length",9.0909090909090917,"m",12,"ft","Wall dimension","Length",13.333333333333334,"m",27,"ft"]
[null,"Height",3.0303030303030303,"m",10,"ft",null,"Height",3.0303030303030303,"m",10,"ft"]
[null,"Area",27.548209366391188,"m2",300,"sqft",null,"Area",40.404040404040408,"m2",440,"sqft"]
["Wall R Value","R value",2.625,"m2/oC/Watt",15,"R-Value","Wall R Value","R value",2.625,"m2/oC/Watt",15,"R-Value"]
[null,"U value",0.38095238095238093,"Watt/m2/oC",6.6666666666666666E-2,"1/R",null,"U value",0.38095238095238093,"Watt/m2/oC",6.6666666666666666E-2,"1/R"]
["Wall Direction","Angle",0,"Degree",null,null,"Wall Direction","Angle",90,"Degree"]
["Window dimension","Length",1.5151515151515151,"m",10,"ft","Window dimension","Length",2.4242424242424243,"m",0,"ft"]
[null,"Height",1.2121212121212122,"m",5,"ft",null,"Height",1.2121212121212122,"m",0,"ft"]
[null,"Amount",4,"#",1,"#",null,"Amount",3,"#",0,"#"]
[null,"Area",7.3461891643709825,"m2",80,"sqft",null,"Area",8.8154269972451793,"m2",96,"sqft"]
["Window Thermal","R value",0.4375,"m2/oC/Watt",2.5,"R-Value","Window Thermal","R value",0.4375,"m2/oC/Watt",2.5,"R-Value"]
[null,"U value",2.2857142857142856,"Watt/m2/oC",0.4,"1/R",null,"U value",2.2857142857142856,"Watt/m2/oC",0.4,"1/R"]
[null,"SHGC",0.65,null,null,null,null,"SHGC",0.65]
[null,"Solar0",93,"watt/m2",null,null,null,"Solar0",285,"watt/m2"]
[null,"SolarCorrect",-6.7,"degC",null,null,null,"SolarCorrect",-1.1000000000000001,"degC"]
[null,"Shading Factor",0.5,null,null,null,null,"Shading Factor",0.5]
["Act. Wall ","Area",20.202020202020204,"m2",null,null,"Act. Wall ","Area",31.588613406795229,"m2"]
["Heating",null,null,null,null,null,"Heating"]
["Wall Heat Loss",null,{"$f":"C31*C43*(OT-RoomT)","v":-223.18422318422321},"watt",{"$f":"2.3*3*(1/2.1)*(22+30)","v":170.85714285714283},null,"Wall Heat Loss",null,{"$f":"I31*I43*(OT-RoomT)","v":-348.97896716078537},"watt"]
["Window Heat Loss",null,{"$f":"C36*C38*(OT-RoomT)","v":-486.9473960383051},"watt",null,null,"Window Heat Loss",null,{"$f":"I36*I38*(OT-RoomT)","v":-584.3368752459661},"watt"]
["Cooling",null,null,null,null,null,"Cooling"]
["Wall Heat Gain",null,{"$f":"C43*C31*($E$24+C41)","v":-36.171236171236174},"watt",null,null,"Wall Heat Gain",null,{"$f":"I43*I31*($E$24-I41)","v":37.304648213739128},"watt"]
["Window Heat Gain",null,{"$f":"C36*C39*C40+C36*C38*$E$24","v":477.65971402335038},"watt",null,null,"Window Heat Gain",null,{"$f":"I36*I39*I40+I36*I38*$E$24","v":1673.3569460842189},"watt"]
["Envelope-Roof",null,null,null,null,null,"Ventilation "]
["Roof",null,null,null,null,null,"HRV effectiveness",null,0]
["Roof dimension","Length",{"$f":"E52/3.3","v":3.6363636363636367},"m",12,"ft","Venting Rate",null,{"$f":"K52/2.12","v":18.867924528301884},"L/s",40,"CFM"]
[null,"Width",9.0909090909090917,"m",27,"ft","Venting Heating",null,{"$f":"I52*1.2*C24*(1-I51)","v":-656.60377358490553},"watt"]
[null,"Area",{"$f":"C53*C52","v":33.057851239669425},"m2",null,null,"Venting Cooling",null,{"$f":"I52*1.2*E24*(1-I51)","v":45.283018867924518},"watt"]
["Roof R Value","R value",{"$f":"E55*0.175","v":5.25},"m2/oC/Watt",{"$f":"$D$14","v":30},"R-Value","Volumn",{"$f":"B78*B15","v":99.173553719008282},"m3"]
[null,"U value",{"$f":"1/C55","v":0.19047619047619047},"Watt/m2/oC",{"$f":"1/E55","v":3.3333333333333333E-2},"1/R","Air Change",{"$f":"I52*3600/1000/H55","v":0.68490566037735823},"per Hr"]
[null,"Angle","Flat","Degree",null,null,"People"]
["Sky Light dimension","Length",0,"m",null,null,"Person Amount",10,"#",164,"watt per Person"]
[null,"Height",0,"m",null,null,"People heat",{"$f":"J58*H58","v":1640},"watt"]
[null,"Amount",0,"#",null,null,"Lighting"]
{"$rows_left_out":19}
{"sheet":"staff and taste","index":1,"n_rows":78,"n_cols":18,"rows_kept":78,"cut":false,"hidden":false,"merged":[[25,12,25,17],[50,0,50,5],[25,0,25,5],[25,6,25,11]]}
["PROJECT NUMBER","x1610"]
["PROJECT NAME","16060 westminster"]
["INPUT BY","XT",null,null,"Manitoba"]
["DATE","2016-12-03"]
["City","Richmond",null,{"$f":"VLOOKUP(B5,WeatherData,2,FALSE )","v":"BC"}]
["Latitude",{"$f":"VLOOKUP(B5,WeatherData,23,FALSE )","v":49.17},"N","Lfactor",{"$f":"1+(B6-40)*0.0375","v":1.3438750000000002}]
["Winter Design Temp.",-10,"degC"]
["Summer Design Temp",30,"degC"]
["Wall Type","Wall Type 3"]
["Wall R value",{"$f":"D10*0.176","v":2.6399999999999997},"m2/oC/Watt",{"$f":"VLOOKUP(B9,Wall_R_value!B2:D13,2,FALSE)","v":15},"R-Value"]
["Window Type","Window Type 2"]
["Window R value",{"$f":"D12*0.175","v":0.35},"m2/oC/Watt",{"$f":"VLOOKUP(B11,WindowData,3,FALSE)","v":2},"R-Value","SHGC",0.33]
["Roof Type","Roof Type 6"]
["Roof R Value",{"$f":"D14*0.175","v":5.25},"m2/oC/Watt",{"$f":"VLOOKUP(B13,RoofData,2,FALSE)","v":30},"R-Value"]
["Floor Height",3,"meter"]
["Room temp _Winter",22,"degC"]
["Room Temp_Summer",24,"degC"]
[]
["Heating / Cooling Load Calculation"]
[]
["ROOM NO.",null,"Kitchen"]
[null,null,"Winter",null,"Summer"]
["Room Temperature",null,22,"degC",{"$f":"$B$17","v":24},"degC"]
["Temperature difference",null,{"$f":"OT-RoomT","v":-32},"degC",{"$f":"OT_Summer-E23","v":6},"degC"]
["Envelope-Wall"]
["Wall 1",null,null,null,null,null,"Wall 2",null,null,null,null,null,"Wall 3"]
["Wall dimension","Length",9.0909090909090917,"m",30,"ft","Wall dimension","Length",13.333333333333334,"m",44,"ft","Wall dimension","Length",9.0909090909090917,"m",30,"ft"]
[null,"Height",3.0303030303030303,"m",10,"ft",null,"Height",3.0303030303030303,"m",10,"ft",null,"Height",3.0303030303030303,"m",10,"ft"]
[null,"Area",27.548209366391188,"m2",300,"sqft",null,"Area",40.404040404040408,"m2",440,"sqft",null,"Area",27.548209366391188,"m2",300,"sqft"]
["Wall R Value","R value",2.625,"m2/oC/Watt",15,"R-Value","Wall R Value","R value",2.625,"m2/oC/Watt",15,"R-Value","Wall R Value","R value",2.625,"m2/oC/Watt",15,"R-Value"]
[null,"U value",0.38095238095238093,"Watt/m2/oC",6.6666666666666666E-2,"1/R",null,"U value",0.38095238095238093,"Watt/m2/oC",6.6666666666666666E-2,"1/R",null,"U value",0.38095238095238093,"Watt/m2/oC",6.6666666666666666E-2,"1/R"]
["Wall Direction","Angle",0,"Degree",null,null,"Wall Direction","Angle",90,"Degree",null,null,"Wall Direction","Angle",270,"Degree"]
["Window dimension","Length",1.5151515151515151,"m",5,"ft","Window dimension","Length",2.4242424242424243,"m",8,"ft","Window dimension","Length",2.4242424242424243,"m",8,"ft"]
[null,"Height",1.2121212121212122,"m",4,"ft",null,"Height",1.2121212121212122,"m",4,"ft",null,"Height",1.5151515151515151,"m",5,"ft"]
[null,"Amount",4,"#",4,"#",null,"Amount",3,"#",3,"#",null,"Amount",2.5,"#",2.5,"#"]
[null,"Area",7.3461891643709825,"m2",80,"sqft",null,"Area",8.8154269972451793,"m2",96,"sqft",null,"Area",9.1827364554637274,"m2",100,"sqft"]
["Window Thermal","R value",0.4375,"m2/oC/Watt",2.5,"R-Value","Window Thermal","R value",0.4375,"m2/oC/Watt",2.5,"R-Value","Window Thermal","R value",0.4375,"m2/oC/Watt",2.5,"R-Value"]
[null,"U value",2.2857142857142856,"Watt/m2/oC",0.4,"1/R",null,"U value",2.2857142857142856,"Watt/m2/oC",0.4,"1/R",null,"U value",2.2857142857142856,"Watt/m2/oC",0.4,"1/R"]
[null,"SHGC",0.65,null,null,null,null,"SHGC",0.65,null,null,null,null,"SHGC",0.65]
[null,"Solar0",93,"watt/m2",null,null,null,"Solar0",285,"watt/m2",null,null,null,"Solar0",285,"watt/m2"]
[null,"SolarCorrect",-6.7,"degC",null,null,null,"SolarCorrect",-1.1000000000000001,"degC",null,null,null,"SolarCorrect",-1.1000000000000001,"degC"]
[null,"Shading Factor",0.5,null,null,null,null,"Shading Factor",0.5,null,null,null,null,"Shading Factor",0.5]
["Act. Wall ","Area",20.202020202020204,"m2",null,null,"Act. Wall ","Area",31.588613406795229,"m2",null,null,"Act. Wall ","Area",18.365472910927458,"m2"]
["Heating",null,null,null,null,null,"Heating",null,null,null,null,null,"Heating"]
["Wall Heat Loss",null,{"$f":"C31*C43*(OT-RoomT)","v":-246.27224627224629},"watt",{"$f":"2.3*3*(1/2.1)*(22+30)","v":170.85714285714283},null,"Wall Heat Loss",null,{"$f":"I31*I43*(OT-RoomT)","v":-385.08023962569422},"watt",null,null,"Wall Heat Loss",null,-209.89111898202808,"watt"]
["Window Heat Loss",null,{"$f":"C36*C38*(OT-RoomT)","v":-537.32126459399183},"watt",null,null,"Window Heat Loss",null,{"$f":"I36*I38*(OT-RoomT)","v":-644.78551751279019},"watt",null,null,"Window Heat Loss",null,-629.67335694608414,"watt"]
["Cooling",null,null,null,null,null,"Cooling",null,null,null,null,null,"Cooling"]
["Wall Heat Gain",null,{"$f":"C43*C31*($E$24+C41)","v":-5.3872053872053893},"watt",null,null,"Wall Heat Gain",null,{"$f":"I43*I31*($E$24-I41)","v":85.439678166950898},"watt",null,null,"Wall Heat Gain",null,48.274957365866463,"watt"]
["Window Heat Gain",null,{"$f":"C36*C39*C40+C36*C38*$E$24","v":544.82487209759938},"watt",null,null,"Window Heat Gain",null,{"$f":"I36*I39*I40+I36*I38*$E$24","v":1753.9551357733176},"watt",null,null,"Window Heat Gain",null,1869.0148235602778,"watt"]
["Envelope-Roof",null,null,null,null,null,"Ventilation "]
["Roof",null,null,null,null,null,"HRV effectiveness",null,0]
["Roof dimension","Length",{"$f":"E52/3.3","v":13.333333333333334},"m",44,"ft","Venting Rate",null,{"$f":"K52/2.12","v":47.169811320754718},"L/s",100,"CFM"]
[null,"Width",{"$f":"E53/3.3","v":9.0909090909090917},"m",30,"ft","Venting Heating",null,{"$f":"I52*1.2*C24*(1-I51)","v":-1811.3207547169811},"watt"]
[null,"Area",{"$f":"C53*C52","v":121.21212121212123},"m2",null,null,"Venting Cooling",null,{"$f":"I52*1.2*E24*(1-I51)","v":339.62264150943395},"watt"]
["Roof R Value","R value",{"$f":"E55*0.175","v":5.25},"m2/oC/Watt",{"$f":"$D$14","v":30},"R-Value","Volumn",{"$f":"B78*B15","v":363.63636363636368},"m3"]
[null,"U value",{"$f":"1/C55","v":0.19047619047619047},"Watt/m2/oC",{"$f":"1/E55","v":3.3333333333333333E-2},"1/R","Air Change",{"$f":"I52*3600/1000/H55","v":0.46698113207547159},"per Hr"]
[null,"Angle","Flat","Degree",null,null,"People"]
["Sky Light dimension","Length",0,"m",null,null,"Person Amount",30,"#",164,"watt per Person"]
[null,"Height",0,"m",null,null,"People heat",{"$f":"J58*H58","v":4920},"watt"]
[null,"Amount",0,"#",null,null,"Lighting"]
{"$rows_left_out":19}
{"sheet":"Window","index":2,"n_rows":0,"n_cols":0,"rows_kept":0,"cut":false,"hidden":false,"merged":[]}

{"sheet":"Summary","index":3,"n_rows":32,"n_cols":7,"rows_kept":32,"cut":false,"hidden":false,"merged":[]}
[]
[]
[]
[]
[]
[]
[]
[]
[]
[]
[]
[]
[]
[]
[]
[]
[null,null,null,null,null,null,1.5]
[null,null,null,null,null,null,1.25]
[null,null,null,null,null,null,1]
[null,null,null,null,null,null,1.25]
[null,null,null,null,null,null,0.5]
[null,null,null,null,null,null,0.25]
[null,null,null,null,null,null,1.5]
[null,null,null,null,null,null,1.5]
[null,null,null,null,null,null,1.25]
[null,null,null,null,null,null,1]
[null,null,null,null,null,null,1.25]
[null,null,null,null,null,null,0.5]
[null,null,null,null,null,null,0.25]
[null,null,null,null,null,null,1.5]
[null,null,null,null,null,"sum",{"$f":"SUM(G17:G30)","v":14.5}]
[null,null,null,null,null,null,{"$f":"G31*1000/20/7","v":103.57142857142857}]

{"sheet":"Solar","index":4,"n_rows":57,"n_cols":6,"rows_kept":57,"cut":false,"hidden":false,"merged":[]}
[]
[]
[]
[]
[]
[]
[]
[]
[]
[]
[]
[]
[]
[]
[]
[]
[]
[]
[]
[]
[]
[]
[]
[]
[]
[]
[]
[]
[]
[]
[]
[]
[]
[]
[]
[]
[]
[]
[]
[]
[]
[]
[null,null,null,"Solar gain","Solar corrections"]
[null,null,"degree","watt/m2","below 14 C","over 14 C"]
[null,"North",0,93,-3.8,-6.7]
[null,"Northeast",45,194,-0.6,-3.3]
[null,"East",90,285,1.7,-1.1000000000000001]
[null,"Southeast",135,252,0.6,-2.2000000000000002]
[null,"South",180,160,-2.2000000000000002,-5]
[null,"Southwest",225,252,0.6,-2.2000000000000002]
[null,"West",270,285,1.7,-1.1000000000000001]
[null,"Northwest",315,194,-0.6,-3.3]
[]
[null,"Flat","Flat",534,-3.3,-6.1]
[]
[]
[null,null,"Solar=C46:D52"]

{"sheet":"Weather_Stations","index":5,"n_rows":683,"n_cols":28,"rows_kept":683,"cut":false,"hidden":false,"merged":[[0,0,0,12],[0,18,1,22],[1,0,1,4]]}
["F280 weather data for Spreadsheet project (Interpreted from CSA_F280_Table 5_Final_2012-01-03.xls by Philip Jarrett Environment Canada)"]
["\"Jan 16, 2012 (All values rounded to zero decimal places)",null,null,null,null,"(Corrected Jan 16, 2012: Grimsby)",null,null,null,null,null,null,null,"Monthly Air Temperatures (Deg C)"]
["Seq","City","Region","DegDay","DHDBT","DCDBT","Strange","OHR","DGTEMP","JanWind","JulWind","Jan","Feb","Mar","Apr","May","Jun","Jul","Aug","Sep","Oct","Nov","Dec","Latidude","Longitude"]
[1,"Athabasca","AB",6000,-35,27,12,11,5,10,10,-15,-11,-4,4,11,14,16,15,10,4,-6,-13,54.72,-113.28,"AB","AB","Alberta"]
[2,"Banff","AB",5500,-31,27,14,7,5,10,8,-9,-7,-3,3,7,11,15,14,9,3,-4,-9,51.17,-115.57,"BC","BC","British Columbia"]
[3,"Barrhead","AB",5740,-33,27,12,11,5,8,9,-11,-11,-6,1,11,13,17,13,12,5,-3,-10,54.13,-114.4,"MB","MB","Manitoba"]
[4,"Beaverlodge","AB",5700,-36,28,12,9,5,10,12,-13,-10,-4,4,10,13,15,14,10,4,-6,-11,55.22,-119.43,"NB","NB","New Brunswick"]
[5,"Brooks","AB",4880,-32,32,14,10,7,13,12,-11,-7,-2,6,11,16,19,18,13,6,-2,-7,50.58,-111.88,"NL","NL","Newfoundland"]
[6,"Calgary","AB",5000,-30,28,12,8,6,15,14,-7,-5,-2,5,10,14,16,16,11,5,-3,-6,51.05,-114.08,"NS","NS","Nova Scotia"]
[7,"Campsie","AB",5750,-33,27,14,11,5,10,12,-14,-11,-4,4,10,14,16,15,10,4,-6,-12,54.13,-114.65,"NT","NT","N.W.T"]
[8,"Camrose","AB",5500,-33,29,13,10,5,11,12,-14,-10,-6,4,10,14,17,15,10,3,-5,-10,53.02,-112.83,"NU","NU","Nunavut"]
[9,"Canmore","AB",5400,-31,28,14,8,6,10,8,-10,-7,-3,3,7,11,15,14,9,3,-4,-9,51.09,-115.35,"ON","ON","Ontario"]
[10,"Cardston","AB",4700,-29,30,13,9,7,13,11,-5,-3,-1,5,10,14,18,17,12,6,0,-3,49.2,-113.3,"PE","PE","Prince Edward Island"]
[11,"Claresholm","AB",4680,-30,30,15,8,6,13,12,-8,-4,-2,5,10,14,18,17,12,6,-1,-5,50.03,-113.58,"QC","QC","Quebec"]
[12,"Cold Lake","AB",5860,-35,28,11,10,4,9,11,-16,-12,-5,4,10,15,17,16,10,3,-7,-13,54.45,-110.17,"SK","SK","Saskatchewan"]
[13,"Coleman","AB",5210,-31,29,15,8,7,14,10,-8,-5,-1,3,8,12,14,14,10,5,-3,-7,49.63,-114.5,"YT","YT","Yukon Territory"]
[14,"Coronation","AB",5640,-32,30,13,9,5,17,15,-14,-12,-5,4,10,14,17,16,10,4,-7,-12,52.08,-111.45]
[15,"Cowley","AB",4810,-29,29,15,8,6,26,18,-10,-6,-2,3,9,13,16,16,10,5,-2,-6,49.57,-114.08]
[16,"Drumheller","AB",5050,-32,30,14,8,5,7,10,-13,-8,-3,6,11,16,19,18,13,5,-3,-9,51.47,-112.7]
[17,"Edmonton","AB",5120,-30,28,10,10,5,11,12,-11,-8,-3,5,11,15,18,17,11,5,-4,-9,53.55,-113.47]
[18,"Edson","AB",5750,-34,27,13,9,5,7,8,-11,-8,-4,3,8,13,15,14,9,3,-6,-10,53.58,-116.43]
[19,"Embarras Portage","AB",7100,-41,28,11,10,3,10,12,-22,-17,-9,1,9,14,17,15,9,1,-10,-19,58.45,-111.47]
[20,"Fairview","AB",5840,-37,27,11,9,4,10,10,-14,-11,-5,4,11,14,16,15,10,4,-7,-12,56.07,-118.38]
[21,"Fort MacLeod","AB",4600,-30,31,15,9,8,21,16,-7,-4,0,6,11,15,18,17,12,7,-1,-6,49.72,-113.42]
[22,"Fort McMurray","AB",6250,-38,28,12,10,4,8,9,-18,-13,-6,3,10,15,17,15,10,2,-9,-15,56.73,-111.38]
[23,"Fort Saskatchewan","AB",5420,-32,28,13,10,5,13,12,-13,-10,-4,5,11,15,17,16,11,5,-6,-12,53.72,-113.22]
[24,"Fort Vermilion","AB",6700,-41,28,12,9,4,8,6,-22,-17,-10,2,11,15,17,15,9,2,-10,-20,58.4,-116]
[25,"Grande Prairie","AB",5790,-36,27,12,9,5,9,12,-14,-11,-5,4,10,14,16,15,10,4,-7,-11,55.17,-118.8]
[26,"Habay","AB",6750,-41,28,13,9,4,8,6,-26,-20,-14,2,11,14,15,14,7,2,-13,-18,58.83,-118.73]
[27,"Hardisty","AB",5640,-33,30,13,9,5,12,13,-17,-12,-7,3,11,15,16,17,9,5,-6,-13,52.67,-111.3]
[28,"High River","AB",4900,-31,28,15,8,6,17,15,-8,-6,-2,4,9,13,15,15,10,5,-2,-7,50.58,-113.87]
[29,"Hinton","AB",5500,-34,27,15,8,6,9,8,-12,-8,-4,3,8,11,14,13,9,4,-6,-8,53.4,-117.58]
[30,"Jasper","AB",5300,-31,28,12,8,6,9,8,-8,-5,-1,4,9,13,15,14,10,4,-4,-9,52.88,-118.08]
[31,"Keg River","AB",6520,-40,28,15,9,4,9,10,-19,-14,-7,3,9,14,15,14,9,1,-12,-16,57.75,-117.62]
[32,"Lac la Biche","AB",6100,-35,28,12,10,4,7,9,-16,-11,-6,3,10,14,17,16,11,4,-6,-13,54.77,-111.97]
[33,"Lacombe","AB",5500,-33,28,13,10,5,10,11,-13,-9,-5,4,9,13,16,15,10,4,-5,-9,52.47,-113.73]
[34,"Lethbridge","AB",4500,-30,31,14,9,8,20,15,-6,-4,0,6,11,15,18,18,13,7,-1,-5,49.7,-112.82]
[35,"Manning","AB",6300,-39,27,11,9,4,10,11,-18,-13,-7,3,10,14,16,15,10,2,-9,-14,56.92,-117.62]
[36,"Medicine Hat","AB",4540,-31,32,13,8,8,14,13,-9,-5,0,7,12,17,20,19,13,7,-2,-7,50.05,-110.67]
[37,"Peace River","AB",6050,-37,27,12,9,4,12,12,-15,-12,-6,4,10,14,16,15,10,3,-8,-12,56.23,-117.28]
[38,"Pincher Creek","AB",4740,-29,29,13,8,6,26,18,-6,-3,-2,4,9,13,17,17,12,6,-1,-4,49.48,-113.95]
[39,"Ranfurly","AB",5700,-34,29,12,10,5,12,12,-14,-12,-6,4,11,15,17,16,10,5,-6,-13,53.42,-111.68]
[40,"Red Deer","AB",5550,-32,28,13,10,5,12,12,-12,-9,-4,4,10,14,16,15,10,4,-5,-10,52.27,-113.8]
[41,"Rocky Mountain House","AB",5640,-32,27,13,9,5,7,8,-12,-9,-5,3,8,12,15,14,9,3,-6,-10,52.37,-114.92]
[42,"Slave Lake","AB",5850,-35,26,11,11,4,15,12,-13,-10,-5,3,9,14,16,15,10,3,-6,-12,55.28,-114.77]
[43,"Stettler","AB",5300,-32,30,14,9,5,16,13,-13,-9,-3,5,10,14,16,16,11,5,-5,-11,52.32,-112.72]
[44,"Stony Plain","AB",5300,-32,28,11,10,5,11,10,-12,-8,-3,5,11,15,16,16,11,5,-4,-10,53.53,-114]
[45,"Suffield","AB",4770,-31,32,15,10,8,18,18,-11,-7,-1,6,12,16,19,19,13,7,-3,-9,50.2,-111.17]
[46,"Taber","AB",4580,-31,31,15,9,8,19,13,-9,-4,-1,6,12,16,19,18,13,7,-1,-6,49.78,-112.15]
[47,"Turner Valley","AB",5220,-31,28,15,8,5,17,15,-10,-7,-3,2,7,11,13,13,9,4,-3,-9,50.67,-114.28]
[48,"Valleyview","AB",5600,-37,27,13,9,4,15,13,-13,-9,-2,5,10,14,16,15,10,5,-4,-11,55.07,-117.28]
[49,"Vegreville","AB",5780,-34,29,13,10,5,12,13,-15,-11,-6,4,10,14,17,15,10,3,-6,-11,53.5,-112.05]
[50,"Vermilion","AB",5740,-35,29,13,10,5,12,12,-18,-14,-7,4,11,15,16,15,10,4,-5,-14,53.37,-110.85]
[51,"Wagner","AB",5850,-35,26,12,11,4,15,12,-13,-10,-5,3,9,14,16,15,10,3,-6,-12,55.35,-114.98]
[52,"Wainwright","AB",5700,-33,29,12,10,5,12,13,-14,-9,-6,5,10,15,18,17,11,4,-4,-11,52.82,-110.87]
[53,"Wetaskiwin","AB",5500,-33,29,13,10,5,10,11,-15,-11,-6,3,11,15,16,16,9,5,-6,-12,52.97,-113.37]
[54,"Whitecourt","AB",5650,-33,27,12,11,5,7,8,-12,-8,-3,4,10,14,16,14,9,4,-7,-11,54.15,-115.68]
[55,"Wimborne","AB",5310,-31,29,13,8,5,15,14,-13,-9,-6,2,10,14,16,15,10,4,-5,-9,51.87,-113.58]
[56,"100 Mile House","BC",5030,-30,29,15,7,8,10,8,-8,-4,0,5,9,13,15,15,10,5,-2,-8,51.65,-121.2833]
[57,"Abbotsford","BC",2860,-8,29,11,11,11,10,8,4,5,7,10,13,16,18,18,15,11,6,3,49.051699999999997,-122.3289]
{"$rows_left_out":624}
{"sheet":"Wall_R_value","index":6,"n_rows":13,"n_cols":4,"rows_kept":13,"cut":false,"hidden":false,"merged":[]}
["No.","Wall Type","R value","RSI"]
[1,"Wall Type 1",5,{"$f":"C2*0.176","v":0.87999999999999989}]
[2,"Wall Type 2",10,{"$f":"C3*0.176","v":1.7599999999999998}]
[3,"Wall Type 3",15,2.6399999999999997]
[4,"Wall Type 4",20,3.5199999999999996]
[5,"Wall Type 5",25,4.3999999999999995]
[6,"Wall Type 6",30,5.2799999999999994]
[7,"Wall Type 7",35,6.1599999999999993]
[8,"Wall Type 8",40,7.0399999999999991]
[9,"Wall Type 9",45,7.92]
[10,"Wall Type 10",50,8.7999999999999989]
[11,"Wall Type 11",55,9.68]
[12,"Wall Type 12",60,10.559999999999999]

{"sheet":"WindowData","index":7,"n_rows":22,"n_cols":5,"rows_kept":22,"cut":false,"hidden":false,"merged":[]}
["No.","Window Type","R value","RSI","Solar heat gain co."]
[null,null,"w/m2.degC","btu/sqft.F","SHGC"]
[1,"Window Type 1",{"$f":"D3*0.175","v":0.17499999999999999},1,0.65]
[2,"Window Type 2",{"$f":"D4*0.175","v":0.35},2,0.65]
[3,"Window Type 3",0.52499999999999991,3,0.65]
[4,"Window Type 4",0.7,4,0.65]
[5,"Window Type 5",0.875,5,0.65]
[6,"Window Type 6",1.0499999999999998,6,0.65]
[7,"Window Type 7",1.2249999999999999,7,0.65]
[8,"Window Type 8",1.4,8,0.65]
[9,"Window Type 9",1.575,9,0.65]
[10,"Window Type 10",1.75,10,0.65]
[11,"Window Type 1",{"$f":"D13*0.175","v":0.17499999999999999},1,0.4]
[12,"Window Type 2",0.35,2,0.4]
[13,"Window Type 3",0.52499999999999991,3,0.4]
[14,"Window Type 4",0.7,4,0.4]
[15,"Window Type 5",0.875,5,0.4]
[16,"Window Type 6",1.0499999999999998,6,0.4]
[17,"Window Type 7",1.2249999999999999,7,0.4]
[18,"Window Type 8",1.4,8,0.4]
[19,"Window Type 9",1.575,9,0.4]
[20,"Window Type 10",1.75,10,0.4]

{"sheet":"RoofData","index":8,"n_rows":13,"n_cols":4,"rows_kept":13,"cut":false,"hidden":false,"merged":[]}
["No.","Wall Type","R value","RSI"]
[1,"Roof Type 1",5,{"$f":"C2*0.176","v":0.87999999999999989}]
[2,"Roof Type 2",10,{"$f":"C3*0.176","v":1.7599999999999998}]
[3,"Roof Type 3",15,2.6399999999999997]
[4,"Roof Type 4",20,3.5199999999999996]
[5,"Roof Type 5",25,4.3999999999999995]
[6,"Roof Type 6",30,5.2799999999999994]
[7,"Roof Type 7",35,6.1599999999999993]
[8,"Roof Type 8",40,7.0399999999999991]
[9,"Roof Type 9",45,7.92]
[10,"Roof Type 10",50,8.7999999999999989]
[11,"Roof Type 11",55,9.68]
[12,"Roof Type 12",60,10.559999999999999]